Reaction Details
TargetPolycomb protein EED
LigandBDBM172038
Substrate/Competitorn/a
Meas. Tech.ChEMBL_1658555 (CHEMBL4008167)
IC50 40±n/a nM
Citation Huang, YZhang, JYu, ZZhang, HWang, YLingel, AQi, WGu, JZhao, KShultz, MDWang, LFu, XSun, YZhang, QJiang, XZhang, JZhang, CLi, LZeng, JFeng, LZhang, CLiu, YZhang, MZhang, LZhao, MGao, ZLiu, XFang, DGuo, HMi, YGabriel, TDillon, MPAtadja, POyang, C Discovery of First-in-Class, Potent, and Orally Bioavailable Embryonic Ectoderm Development (EED) Inhibitor with Robust Anticancer Efficacy. J Med Chem60:2215-2226 (2017) 
 
Polycomb protein EED
Name:Polycomb protein EED
Type:Protein
Mol. Mass.:50201.68
Organism:Homo sapiens (Human)
Description:O75530
Residue:441
BDBM172038
NameBDBM172038
Synonyms:US10155002, Compound 44 US11052093, Compound 143 US9090562, 143 US9394283, 1
TypeSmall organic molecule
Emp. Form.C34H44N4O4
Mol. Mass.572.7376
SMILESCCN(C1CCOCC1)c1cc(cc(C(=O)NCc2c(C)cc(C)[nH]c2=O)c1C)-c1ccc(CN2CCOCC2)cc1