Reaction Details
TargetPolycomb protein EED
LigandBDBM50236006
Substrate/Competitorn/a
Meas. Tech.ChEMBL_1658554 (CHEMBL4008166)
IC50 20±n/a nM
Citation Huang, YZhang, JYu, ZZhang, HWang, YLingel, AQi, WGu, JZhao, KShultz, MDWang, LFu, XSun, YZhang, QJiang, XZhang, JZhang, CLi, LZeng, JFeng, LZhang, CLiu, YZhang, MZhang, LZhao, MGao, ZLiu, XFang, DGuo, HMi, YGabriel, TDillon, MPAtadja, POyang, C Discovery of First-in-Class, Potent, and Orally Bioavailable Embryonic Ectoderm Development (EED) Inhibitor with Robust Anticancer Efficacy. J Med Chem60:2215-2226 (2017) 
 
Polycomb protein EED
Name:Polycomb protein EED
Type:Protein
Mol. Mass.:50201.68
Organism:Homo sapiens (Human)
Description:O75530
Residue:441
BDBM50236006
NameBDBM50236006
Synonyms:CHEMBL4099766
TypeSmall organic molecule
Emp. Form.C21H20N6S
Mol. Mass.388.489
SMILESCN(C)Cc1ccc(cc1)-c1cc(C#N)c(NCc2cccs2)n2cnnc12