Reaction Details
TargetPolycomb protein EED
LigandBDBM50236018
Substrate/Competitorn/a
Meas. Tech.ChEMBL_1658554 (CHEMBL4008166)
IC50 21800±n/a nM
Citation Huang, YZhang, JYu, ZZhang, HWang, YLingel, AQi, WGu, JZhao, KShultz, MDWang, LFu, XSun, YZhang, QJiang, XZhang, JZhang, CLi, LZeng, JFeng, LZhang, CLiu, YZhang, MZhang, LZhao, MGao, ZLiu, XFang, DGuo, HMi, YGabriel, TDillon, MPAtadja, POyang, C Discovery of First-in-Class, Potent, and Orally Bioavailable Embryonic Ectoderm Development (EED) Inhibitor with Robust Anticancer Efficacy. J Med Chem60:2215-2226 (2017) 
 
Polycomb protein EED
Name:Polycomb protein EED
Type:Protein
Mol. Mass.:50201.68
Organism:Homo sapiens (Human)
Description:O75530
Residue:441
BDBM50236018
NameBDBM50236018
Synonyms:CHEMBL4079016
TypeSmall organic molecule
Emp. Form.C22H22N6S
Mol. Mass.402.515
SMILESCN(C)Cc1ccc(cc1)-c1cc(C#N)c(NCc2sccc2C)n2cnnc12