Reaction Details
TargetDihydrofolate reductase
LigandBDBM50232534
Substrate/Competitorn/a
Meas. Tech.ChEMBL_1660724 (CHEMBL4010336)
IC50>30000±n/a nM
Citation Gopalsamy, ANarayanan, ALiu, SParikh, MDKyne, REFadeyi, OTones, MACherry, JJNabhan, JFLaRosa, GPetersen, DNMenard, CFoley, TLNoell, SRen, YLoria, PMMaglich-Goodwin, JRong, HJones, LH Design of Potent mRNA Decapping Scavenger Enzyme (DcpS) Inhibitors with Improved Physicochemical Properties To Investigate the Mechanism of Therapeutic Benefit in Spinal Muscular Atrophy (SMA). J Med Chem60:3094-3108 (2017) 
 
Dihydrofolate reductase
Name:Dihydrofolate reductase
Type:Enzyme
Mol. Mass.:21453.99
Organism:Homo sapiens (Human)
Description:Recombinant human DHFR.
Residue:187
BDBM50232534
NameBDBM50232534
Synonyms:5-((2-fluorophenoxy)methyl)quinazoline-2,4-diamine | CHEMBL251906
TypeSmall organic molecule
Emp. Form.C15H13FN4O
Mol. Mass.284.2883
SMILESNc1nc(N)c2c(COc3ccccc3F)cccc2n1