Reaction Details
Targetm7GpppX diphosphatase
LigandBDBM50237202
Substrate/Competitorn/a
Meas. Tech.ChEMBL_1660723 (CHEMBL4010335)
IC50 1.4±n/a nM
Citation Gopalsamy, ANarayanan, ALiu, SParikh, MDKyne, REFadeyi, OTones, MACherry, JJNabhan, JFLaRosa, GPetersen, DNMenard, CFoley, TLNoell, SRen, YLoria, PMMaglich-Goodwin, JRong, HJones, LH Design of Potent mRNA Decapping Scavenger Enzyme (DcpS) Inhibitors with Improved Physicochemical Properties To Investigate the Mechanism of Therapeutic Benefit in Spinal Muscular Atrophy (SMA). J Med Chem60:3094-3108 (2017) 
 
m7GpppX diphosphatase
Name:m7GpppX diphosphatase
Type:Enzyme
Mol. Mass.:38606.80
Organism:Homo sapiens (Human)
Description:Q96C86
Residue:337
BDBM50237202
NameBDBM50237202
Synonyms:CHEMBL4103454
TypeSmall organic molecule
Emp. Form.C22H24F3N5O2
Mol. Mass.447.4535
SMILESNc1nc(N)c2c(OCC3CCN(Cc4ccccc4OC(F)(F)F)CC3)cccc2n1