Reaction Details
Targetm7GpppX diphosphatase
LigandBDBM50237213
Substrate/Competitorn/a
Meas. Tech.ChEMBL_1660723 (CHEMBL4010335)
IC50>10000±n/a nM
Citation Gopalsamy, ANarayanan, ALiu, SParikh, MDKyne, REFadeyi, OTones, MACherry, JJNabhan, JFLaRosa, GPetersen, DNMenard, CFoley, TLNoell, SRen, YLoria, PMMaglich-Goodwin, JRong, HJones, LH Design of Potent mRNA Decapping Scavenger Enzyme (DcpS) Inhibitors with Improved Physicochemical Properties To Investigate the Mechanism of Therapeutic Benefit in Spinal Muscular Atrophy (SMA). J Med Chem60:3094-3108 (2017) 
 
m7GpppX diphosphatase
Name:m7GpppX diphosphatase
Type:Enzyme
Mol. Mass.:38606.80
Organism:Homo sapiens (Human)
Description:Q96C86
Residue:337
BDBM50237213
NameBDBM50237213
Synonyms:CHEMBL4102384
TypeSmall organic molecule
Emp. Form.C17H14FN5O
Mol. Mass.323.3244
SMILESCc1cc(COc2cc(F)cc(c2)C#N)c2c(N)nc(N)nc2c1