Reaction Details
TargetDihydrofolate reductase
LigandBDBM50237205
Substrate/Competitorn/a
Meas. Tech.ChEMBL_1660724 (CHEMBL4010336)
IC50 630±n/a nM
Citation Gopalsamy, ANarayanan, ALiu, SParikh, MDKyne, REFadeyi, OTones, MACherry, JJNabhan, JFLaRosa, GPetersen, DNMenard, CFoley, TLNoell, SRen, YLoria, PMMaglich-Goodwin, JRong, HJones, LH Design of Potent mRNA Decapping Scavenger Enzyme (DcpS) Inhibitors with Improved Physicochemical Properties To Investigate the Mechanism of Therapeutic Benefit in Spinal Muscular Atrophy (SMA). J Med Chem60:3094-3108 (2017) 
 
Dihydrofolate reductase
Name:Dihydrofolate reductase
Type:Enzyme
Mol. Mass.:21453.99
Organism:Homo sapiens (Human)
Description:Recombinant human DHFR.
Residue:187
BDBM50237205
NameBDBM50237205
Synonyms:CHEMBL398675
TypeSmall organic molecule
Emp. Form.C15H12F2N4O
Mol. Mass.302.2788
SMILESNc1nc(N)c2c(OCc3cc(F)cc(F)c3)cccc2n1