Reaction Details
TargetDihydrofolate reductase
LigandBDBM50237206
Substrate/Competitorn/a
Meas. Tech.ChEMBL_1660724 (CHEMBL4010336)
IC50 15000±n/a nM
Citation Gopalsamy, ANarayanan, ALiu, SParikh, MDKyne, REFadeyi, OTones, MACherry, JJNabhan, JFLaRosa, GPetersen, DNMenard, CFoley, TLNoell, SRen, YLoria, PMMaglich-Goodwin, JRong, HJones, LH Design of Potent mRNA Decapping Scavenger Enzyme (DcpS) Inhibitors with Improved Physicochemical Properties To Investigate the Mechanism of Therapeutic Benefit in Spinal Muscular Atrophy (SMA). J Med Chem60:3094-3108 (2017) 
 
Dihydrofolate reductase
Name:Dihydrofolate reductase
Type:Enzyme
Mol. Mass.:21453.99
Organism:Homo sapiens (Human)
Description:Recombinant human DHFR.
Residue:187
BDBM50237206
NameBDBM50237206
Synonyms:CHEMBL4075292
TypeSmall organic molecule
Emp. Form.C13H16N4O2
Mol. Mass.260.2917
SMILESCC1(COc2cccc3nc(N)nc(N)c23)COC1