Reaction Details
TargetDihydrofolate reductase
LigandBDBM50237208
Substrate/Competitorn/a
Meas. Tech.ChEMBL_1660724 (CHEMBL4010336)
IC50 25000±n/a nM
Citation Gopalsamy, ANarayanan, ALiu, SParikh, MDKyne, REFadeyi, OTones, MACherry, JJNabhan, JFLaRosa, GPetersen, DNMenard, CFoley, TLNoell, SRen, YLoria, PMMaglich-Goodwin, JRong, HJones, LH Design of Potent mRNA Decapping Scavenger Enzyme (DcpS) Inhibitors with Improved Physicochemical Properties To Investigate the Mechanism of Therapeutic Benefit in Spinal Muscular Atrophy (SMA). J Med Chem60:3094-3108 (2017) 
 
Dihydrofolate reductase
Name:Dihydrofolate reductase
Type:Enzyme
Mol. Mass.:21453.99
Organism:Homo sapiens (Human)
Description:Recombinant human DHFR.
Residue:187
BDBM50237208
NameBDBM50237208
Synonyms:CHEMBL4090641
TypeSmall organic molecule
Emp. Form.C12H16N4O2
Mol. Mass.248.281
SMILESCOC[C@@H](C)Oc1cccc2nc(N)nc(N)c12