Reaction Details
Targetm7GpppX diphosphatase
LigandBDBM50237219
Substrate/Competitorn/a
Meas. Tech.ChEMBL_1660723 (CHEMBL4010335)
IC50 334±n/a nM
Citation Gopalsamy, ANarayanan, ALiu, SParikh, MDKyne, REFadeyi, OTones, MACherry, JJNabhan, JFLaRosa, GPetersen, DNMenard, CFoley, TLNoell, SRen, YLoria, PMMaglich-Goodwin, JRong, HJones, LH Design of Potent mRNA Decapping Scavenger Enzyme (DcpS) Inhibitors with Improved Physicochemical Properties To Investigate the Mechanism of Therapeutic Benefit in Spinal Muscular Atrophy (SMA). J Med Chem60:3094-3108 (2017) 
 
m7GpppX diphosphatase
Name:m7GpppX diphosphatase
Type:Enzyme
Mol. Mass.:38606.80
Organism:Homo sapiens (Human)
Description:Q96C86
Residue:337
BDBM50237219
NameBDBM50237219
Synonyms:CHEMBL4093512
TypeSmall organic molecule
Emp. Form.C22H25Cl2N5O
Mol. Mass.446.373
SMILESCc1cc(OCC2CCN(Cc3c(Cl)cccc3Cl)CC2)c2c(N)nc(N)nc2c1