Reaction Details
TargetComplement factor D
LigandBDBM50238277
Substrate/Competitorn/a
Meas. Tech.ChEMBL_1663644 (CHEMBL4013325)
IC50 20000±n/a nM
Citation Lorthiois, EAnderson, KVulpetti, ARogel, OCumin, FOstermann, NSteinbacher, SMac Sweeney, ADelgado, OLiao, SMRandl, SRüdisser, SDussauge, SFettis, KKieffer, Lde Erkenez, AYang, LHartwieg, CArgikar, UALa Bonte, LRNewton, RKansara, VFlohr, SHommel, UJaffee, BMaibaum, J Discovery of Highly Potent and Selective Small-Molecule Reversible Factor D Inhibitors Demonstrating Alternative Complement Pathway Inhibition in Vivo. J Med Chem60:5717-5735 (2017) 
 
Complement factor D
Name:Complement factor D
Type:Protein
Mol. Mass.:27039.19
Organism:Homo sapiens (Human)
Description:P00746
Residue:253
BDBM50238277
NameBDBM50238277
Synonyms:CHEMBL4103449
TypeSmall organic molecule
Emp. Form.C22H21F3N4O3
Mol. Mass.446.4223
SMILESCn1cc(NC(=O)N2CCC[C@H]2C(=O)Nc2cccc(OC(F)(F)F)c2)c2ccccc12