Reaction Details
TargetCytochrome P450 2C9
LigandBDBM170821
Substrate/Competitorn/a
Meas. Tech.ChEMBL_1663631 (CHEMBL4013312)
IC50>10000±n/a nM
Citation Lorthiois, EAnderson, KVulpetti, ARogel, OCumin, FOstermann, NSteinbacher, SMac Sweeney, ADelgado, OLiao, SMRandl, SRüdisser, SDussauge, SFettis, KKieffer, Lde Erkenez, AYang, LHartwieg, CArgikar, UALa Bonte, LRNewton, RKansara, VFlohr, SHommel, UJaffee, BMaibaum, J Discovery of Highly Potent and Selective Small-Molecule Reversible Factor D Inhibitors Demonstrating Alternative Complement Pathway Inhibition in Vivo. J Med Chem60:5717-5735 (2017) 
 
Cytochrome P450 2C9
Name:Cytochrome P450 2C9
Type:Enzyme
Mol. Mass.:55636.33
Organism:Homo sapiens (Human)
Description:P11712
Residue:490
BDBM170821
NameBDBM170821
Synonyms:US9085555, 249
TypeSmall organic molecule
Emp. Form.C22H20F3N5O5
Mol. Mass.491.4199
SMILESNC(=O)n1cc(NC(=O)N2C[C@@H](O)C[C@H]2C(=O)Nc2cccc(OC(F)(F)F)c2)c2ccccc12