Reaction Details
TargetComplement factor D
LigandBDBM170759
Substrate/Competitorn/a
Meas. Tech.ChEMBL_1663607 (CHEMBL4013288)
IC50 22000±n/a nM
Citation Lorthiois, EAnderson, KVulpetti, ARogel, OCumin, FOstermann, NSteinbacher, SMac Sweeney, ADelgado, OLiao, SMRandl, SRüdisser, SDussauge, SFettis, KKieffer, Lde Erkenez, AYang, LHartwieg, CArgikar, UALa Bonte, LRNewton, RKansara, VFlohr, SHommel, UJaffee, BMaibaum, J Discovery of Highly Potent and Selective Small-Molecule Reversible Factor D Inhibitors Demonstrating Alternative Complement Pathway Inhibition in Vivo. J Med Chem60:5717-5735 (2017) 
 
Complement factor D
Name:Complement factor D
Type:Protein
Mol. Mass.:27039.19
Organism:Homo sapiens (Human)
Description:P00746
Residue:253
BDBM170759
NameBDBM170759
Synonyms:US9085555, 187
TypeSmall organic molecule
Emp. Form.C23H22F3N5O4
Mol. Mass.489.4471
SMILESNC(=O)n1cc(NC(=O)N2CCCC[C@H]2C(=O)Nc2cccc(OC(F)(F)F)c2)c2ccccc12