Reaction Details
TargetAlpha-glucosidase MAL12
LigandBDBM84964
Substrate/Competitorn/a
Meas. Tech.Inhibition Assay
IC50 6.85e+4± 2.2e+3 nM
Citation Kim, JYLee, JWKim, YSLee, YRyu, YBKim, SRyu, HWCurtis-Long, MJLee, KWLee, WSPark, KH A novel competitive class of α-glucosidase inhibitors: (E)-1-phenyl-3-(4-styrylphenyl)urea derivatives. Chembiochem11:2125-31 (2010) 
 
Alpha-glucosidase MAL12
Name:Alpha-glucosidase MAL12
Type:Protein
Mol. Mass.:68084.32
Organism:Saccharomyces cerevisiae
Description:P53341
Residue:584
BDBM84964
NameBDBM84964
Synonyms:Urea derivative, 8
TypeSmall organic molecule
Emp. Form.C21H19N3O3
Mol. Mass.361.3939
SMILESNc1ccc(NC(=O)Nc2ccc(\C=C\c3ccc(O)c(O)c3)cc2)cc1