Reaction Details
TargetMu-type opioid receptor
LigandBDBM85395
Substrate/Competitorn/a
Ki 1.4±n/a nM
CommentsPDSP_1166
Citation McLaughlin, JPHill, KPJiang, QSebastian, AArcher, SBidlack, JM Nitrocinnamoyl and chlorocinnamoyl derivatives of dihydrocodeinone: in vivo and in vitro characterization of mu-selective agonist and antagonist activity. J Pharmacol Exp Ther289:304-11 (1999) Mu-type opioid receptor
Name:Mu-type opioid receptor
Type:Enzyme Catalytic Domain
Mol. Mass.:45038.37
Organism:CALF
Description:OPIATE Mu 2 0 CALF::P79350
Residue:401
BDBM85395
NameBDBM85395
Synonyms:MC-CAM
TypeSmall organic molecule
Emp. Form.C30H31ClN2O4
Mol. Mass.519.031
SMILESCOc1ccc2CC3N(CC4CC4)CCC45[C@@H](Oc1c24)C(=O)CCC35NC(=O)\C=C/c1ccc(Cl)cc1