Reaction Details
TargetHrh3 protein
LigandBDBM22908
Substrate/Competitorn/a
Ki 5.01±n/a nM
CommentsPDSP_2290
Citation Wieland, KBongers, GYamamoto, YHashimoto, TYamatodani, AMenge, WMTimmerman, HLovenberg, TWLeurs, R Constitutive activity of histamine h(3) receptors stably expressed in SK-N-MC cells: display of agonism and inverse agonism by H(3) antagonists. J Pharmacol Exp Ther299:908-14 (2001) Hrh3 protein
Name:Hrh3 protein
Type:Enzyme Catalytic Domain
Mol. Mass.:37860.96
Organism:RAT
Description:Q5PPG3
Residue:344
BDBM22908
NameBDBM22908
Synonyms:4( 5)-( 5-aminopenty1)-lH-imidazole Impentamine
TypeSmall organic molecule
Emp. Form.C8H15N3
Mol. Mass.153.2248
SMILESNCCCCCc1cnc[nH]1