Reaction Details
TargetHistamine H3 receptor
LigandBDBM85830
Substrate/Competitorn/a
Ki 2.34±n/a nM
CommentsPDSP_2295
Citation Wieland, KBongers, GYamamoto, YHashimoto, TYamatodani, AMenge, WMTimmerman, HLovenberg, TWLeurs, R Constitutive activity of histamine h(3) receptors stably expressed in SK-N-MC cells: display of agonism and inverse agonism by H(3) antagonists. J Pharmacol Exp Ther299:908-14 (2001) Histamine H3 receptor
Name:Histamine H3 receptor
Type:G Protein-Coupled Receptor (GPCR)
Mol. Mass.:48691.47
Organism:Homo sapiens (Human)
Description:Binding assays were using CHO cells stably expressing hH3R receptors.
Residue:445
BDBM85830
NameBDBM85830
Synonyms:VUF5202
TypeSmall organic molecule
Emp. Form.C15H20ClN3
Mol. Mass.277.792
SMILESClc1ccc(CNCCCCCc2cnc[nH]2)cc1