Reaction Details
TargetInhibitor of nuclear factor kappa-B kinase subunit epsilon
LigandBDBM278082
Substrate/Competitorn/a
Meas. Tech.TBK1 and IKKE Biological Assays
pH7±n/a
IC50<1±n/a nM
Commentsextracted
Citation Du, ZGuerrero, JAKaplan, JAKnox, Jr., JELo, JRMitchell, SANaduthambi, DPhillips, BWVenkataramani, CWang, PWatkins, WJZhao, Z Tank-binding kinase inhibitor compounds US Patent US10040781 Publication Date 8/7/2018
 
Inhibitor of nuclear factor kappa-B kinase subunit epsilon
Name:Inhibitor of nuclear factor kappa-B kinase subunit epsilon
Type:Serine/threonine-protein kinase
Mol. Mass.:80475.98
Organism:Homo sapiens (Human)
Description:Kinase inhibitory activity was determined using recombinant human IKK-epsilon expressed in baculovirus as a FLAG-tagged fusion protein.
Residue:716
BDBM278082
NameBDBM278082
Synonyms:(S)-2-((3,3-difluoro-1-formylpiperidin-4-yl)oxy)-5-(4-((3-methyl-4-(1-methylpiperidin-4-yl)phenyl)amino)-1,3,5-triazin-2-yl)benzonitrile US10253019, Example 304
TypeSmall organic molecule
Emp. Form.C29H31F2N7O2
Mol. Mass.547.5989
SMILESCN1CCC(CC1)c1ccc(Nc2ncnc(n2)-c2ccc(O[C@H]3CCN(CC3(F)F)C=O)c(c2)C#N)cc1C