Reaction Details
TargetGlutamate receptor 4
LigandBDBM86751
Substrate/Competitorn/a
Ki>10000±n/a nM
CommentsPDSP_6659
Citation Weiss, BAlt, AOgden, AMGates, MDieckman, DKClemens-Smith, AHo, KHJarvie, KRizkalla, GWright, RACalligaro, DOSchoepp, DMattiuz, ELStratford, REJohnson, BSalhoff, CKatofiasc, MPhebus, LASchenck, KCohen, MFilla, SAOrnstein, PLJohnson, KWBleakman, D Pharmacological characterization of the competitive GLUK5 receptor antagonist decahydroisoquinoline LY466195 in vitro and in vivo. J Pharmacol Exp Ther318:772-81 (2006) 
 
Glutamate receptor 4
Name:Glutamate receptor 4
Type:PROTEIN
Mol. Mass.:100881.87
Organism:Homo sapiens (Human)
Description:ChEMBL_468628
Residue:902
BDBM86751
NameBDBM86751
Synonyms:CHEMBL14935 LY-293558
TypeSmall organic molecule
Emp. Form.C13H21N5O2
Mol. Mass.279.3381
SMILESOC(=O)[C@@H]1C[C@H]2C[C@@H](CCc3nnn[nH]3)CC[C@H]2CN1