Reaction Details
TargetRAC-alpha serine/threonine-protein kinase
LigandBDBM108440
Substrate/Competitorn/a
Meas. Tech.Thermal Shift Assay
pH7.5±0
Temperature353.15±0 K
Kd 0.8±0.0 nM
Citation Ashwell, MABrassard, CFilikov, AHill, JKoerner, SLapierre, JLiu, YNamdev, NNicewonger, RPalma, RTandon, MVensel, DMatsuda, AIimura, SYoshida, KYamazaki, TKitamura, TIsoyama, T Substituted imidazopyridinyl-aminopyridine compounds US Patent US8609688 Publication Date 12/17/2013
 
RAC-alpha serine/threonine-protein kinase
Name:RAC-alpha serine/threonine-protein kinase
Type:Enzyme
Mol. Mass.:55681.25
Organism:Homo sapiens (Human)
Description:P31749
Residue:480
BDBM108440
NameBDBM108440
Synonyms:US8609688, 18
TypeSmall organic molecule
Emp. Form.C31H31N7O2S
Mol. Mass.565.689
SMILESNc1ncccc1-c1nc2ccc(nc2n1-c1ccc(cc1)C1(N)CCC1)-c1cccc(c1)N1CCS(=O)(=O)CC1