Reaction Details
TargetSodium/glucose cotransporter 2
LigandBDBM109275
Substrate/Competitorn/a
Meas. Tech.Inhibition Assay
IC50 1.42±n/a nM
Citation Yang, FTang, PCDong, QTu, WFan, JGuan, DShen, GWang, YYuan, JZhang, L C-aryl glucoside derivatives, preparation process and pharmaceutical use thereof US Patent US8609622 Publication Date 12/17/2013
 
Sodium/glucose cotransporter 2
Name:Sodium/glucose cotransporter 2
Type:Protein
Mol. Mass.:73014.31
Organism:Mus musculus (Mouse)
Description:Q923I7
Residue:670
BDBM109275
NameBDBM109275
Synonyms:US8609622, 2
TypeSmall organic molecule
Emp. Form.C21H21ClF2O7
Mol. Mass.458.837
SMILESCOc1ccc(Cc2cc(ccc2Cl)[C@@]23OC[C@@](CO)(O2)[C@@H](O)[C@H](O)[C@H]3O)c(F)c1F