Reaction Details
TargetSGLT1 protein
LigandBDBM109275
Substrate/Competitorn/a
Meas. Tech.Inhibition Assay
IC50>2000±0.0 nM
Citation Yang, FTang, PCDong, QTu, WFan, JGuan, DShen, GWang, YYuan, JZhang, L C-aryl glucoside derivatives, preparation process and pharmaceutical use thereof US Patent US8609622 Publication Date 12/17/2013
 
SGLT1 protein
Name:SGLT1 protein
Type:Protein
Mol. Mass.:73320.01
Organism:Mus musculus (Mouse)
Description:Q9QXI6
Residue:665
BDBM109275
NameBDBM109275
Synonyms:US8609622, 2
TypeSmall organic molecule
Emp. Form.C21H21ClF2O7
Mol. Mass.458.837
SMILESCOc1ccc(Cc2cc(ccc2Cl)[C@@]23OC[C@@](CO)(O2)[C@@H](O)[C@H](O)[C@H]3O)c(F)c1F