Reaction Details
TargetN-lysine methyltransferase SMYD2
LigandBDBM283170
Substrate/Competitorn/a
Meas. Tech.Scintillation Proximity Assay (SPA) for Detection of SMYD2 Enzymatic Inhibition
pH9±n/a
IC50 30.0±n/a nM
Commentsextracted
Citation Mowat, JSStellfeld, TStresemann, CHillig, RKöhr, SStöckigt, DWeiske, JBrumby, TBarak, NChrist, CTer Laak, ABadock, VCrampton, RHStefanuti, I Aryl-cyanoguanidine compounds US Patent US10023539 Publication Date 7/17/2018
 
N-lysine methyltransferase SMYD2
Name:N-lysine methyltransferase SMYD2
Type:Enzyme
Mol. Mass.:49689.57
Organism:Homo sapiens (Human)
Description:Q9NRG4
Residue:433
BDBM283170
NameBDBM283170
Synonyms:N-[1-{N′-cyano-N-[5-(difluoromethoxy)-2-methoxyphenyl]carbamimidoyl}-3-(3,4-dichlorophenyl)-4,5-dihydro-1H-pyrazol-4-yl]-N-ethyl-2-hydroxyacetamide Isomer 1 US10023539, Example 18.2
TypeSmall organic molecule
Emp. Form.C23H22Cl2F2N6O4
Mol. Mass.555.361
SMILESCCN(C1CN(N=C1c1ccc(Cl)c(Cl)c1)C(\Nc1cc(OC(F)F)ccc1OC)=N/C#N)C(=O)CO