Reaction Details
TargetN-lysine methyltransferase SMYD2
LigandBDBM283172
Substrate/Competitorn/a
Meas. Tech.Cell-Based Assay for Detection of SMYD2 Methylation Activity
IC50 21.3±n/a nM
Citation Mowat, JSStellfeld, TStresemann, CHillig, RKöhr, SStöckigt, DWeiske, JBrumby, TBarak, NChrist, CTer Laak, ABadock, VCrampton, RHStefanuti, I Aryl-cyanoguanidine compounds US Patent US10023539 Publication Date 7/17/2018
 
N-lysine methyltransferase SMYD2
Name:N-lysine methyltransferase SMYD2
Type:Enzyme
Mol. Mass.:49689.57
Organism:Homo sapiens (Human)
Description:Q9NRG4
Residue:433
BDBM283172
NameBDBM283172
Synonyms:Rac-N-[1-{N′-cyano-N-[2-methoxy-5-(trifluoromethyl)phenyl]carbamimidoyl}-3-(3,4-dichlorophenyl)-4,5-dihydro-1H-pyrazol-4-yl]-N-ethyl-2-hydroxyacetamide | US10023539, Example 19
TypeSmall organic molecule
Emp. Form.C23H21Cl2F3N6O3
Mol. Mass.557.352
SMILESCCN(C1CN(N=C1c1ccc(Cl)c(Cl)c1)C(\Nc1cc(ccc1OC)C(F)(F)F)=N/C#N)C(=O)CO