Reaction Details
TargetN-lysine methyltransferase SMYD2
LigandBDBM283194
Substrate/Competitorn/a
Meas. Tech.Scintillation Proximity Assay (SPA) for Detection of SMYD2 Enzymatic Inhibition
pH9±n/a
IC50 5.55±n/a nM
Commentsextracted
Citation Mowat, JSStellfeld, TStresemann, CHillig, RKöhr, SStöckigt, DWeiske, JBrumby, TBarak, NChrist, CTer Laak, ABadock, VCrampton, RHStefanuti, I Aryl-cyanoguanidine compounds US Patent US10023539 Publication Date 7/17/2018
 
N-lysine methyltransferase SMYD2
Name:N-lysine methyltransferase SMYD2
Type:Enzyme
Mol. Mass.:49689.57
Organism:Homo sapiens (Human)
Description:Q9NRG4
Residue:433
BDBM283194
NameBDBM283194
Synonyms:Rac-N-[1-(N′-cyano-N-{5-(difluoromethoxy)-2-[3-(dimethylamino)propoxy]phenyl}-carbamimidoyl)-3-(3,4-dichlorophenyl)-4,5-dihydro-1H-pyrazol-4-yl]-N-ethyl-2-hydroxyacetamide | US10023539, Example 29
TypeSmall organic molecule
Emp. Form.C27H31Cl2F2N7O4
Mol. Mass.626.482
SMILESCCN(C1CN(N=C1c1ccc(Cl)c(Cl)c1)C(\Nc1cc(OC(F)F)ccc1OCCCN(C)C)=N/C#N)C(=O)CO