Reaction Details
TargetSomatostatin receptor type 5
LigandBDBM123235
Substrate/Competitorn/a
Meas. Tech.Binding Assay
pH7.8±n/a
IC50 0.129±n/a nM
Commentsextracted
Citation Duffy, JLBao, JOndeyka, DLTyagarajan, SShao, PYe, FKatipally, RZwicker, ASherer, ECPlotkin, MAMoningka, RHussain, ZWood, HBUjjainwalla, FRomero, FAFinke, PEZang, YLiu, W Spiroxazolidinone compounds US Patent US8742110 Publication Date 6/3/2014
 
Somatostatin receptor type 5
Name:Somatostatin receptor type 5
Type:Enzyme
Mol. Mass.:39218.02
Organism:Homo sapiens (Human)
Description:P35346
Residue:364
BDBM123235
NameBDBM123235
Synonyms:US8742110, 3-20
TypeSmall organic molecule
Emp. Form.C32H35FN2O7
Mol. Mass.578.6279
SMILESCCOc1cc(CN2CCC3(CN(C(=O)O3)c3ccc(C(O)=O)c(OC)c3)CC2)cc(OCC)c1-c1ccc(F)cc1