Reaction Details
TargetSomatostatin receptor type 5
LigandBDBM123253
Substrate/Competitorn/a
Meas. Tech.Binding Assay
pH7.8±n/a
IC50 0.1645±n/a nM
Commentsextracted
Citation Duffy, JLBao, JOndeyka, DLTyagarajan, SShao, PYe, FKatipally, RZwicker, ASherer, ECPlotkin, MAMoningka, RHussain, ZWood, HBUjjainwalla, FRomero, FAFinke, PEZang, YLiu, W Spiroxazolidinone compounds US Patent US8742110 Publication Date 6/3/2014
 
Somatostatin receptor type 5
Name:Somatostatin receptor type 5
Type:Enzyme
Mol. Mass.:39218.02
Organism:Homo sapiens (Human)
Description:P35346
Residue:364
BDBM123253
NameBDBM123253
Synonyms:US8742110, 4-17
TypeSmall organic molecule
Emp. Form.C28H22F6N2O5
Mol. Mass.580.4751
SMILESOC(=O)c1ccc(cc1)N1CC2(CCN(Cc3cc(OC(F)(F)F)ccc3-c3ccc(F)c(F)c3F)CC2)OC1=O