Reaction Details
TargetSerine/threonine-protein kinase mTOR
LigandBDBM136453
Substrate/Competitorn/a
Meas. Tech.Kinase Assay
pH7.5±n/a
Temperature295.15±n/a K
IC50 2.4±n/a nM
Commentsextracted
Citation Andrews, SWCondroski, KRDe Meese, LAFell, JBFischer, JPJosey, JAKoch, KLe Huerou, YMiknis, GFRodriguez, METopalov, GTWallace, EMXu, R Substituted pyrazolo[1,5-a]pyrimidine compounds as mTOR inhibitors US Patent US8865726 Publication Date 10/21/2014
 
Serine/threonine-protein kinase mTOR
Name:Serine/threonine-protein kinase mTOR
Type:Rapamycin target protein
Mol. Mass.:288917.12
Organism:Homo sapiens (Human)
Description:P42345
Residue:2549
BDBM136453
NameBDBM136453
Synonyms:US8865726, 84
TypeSmall organic molecule
Emp. Form.C22H15FN8O2
Mol. Mass.442.4053
SMILESFc1cc(ccc1-c1nc[nH]n1)-c1cnn2ccc(nc12)N1[C@H](COC1=O)c1cccnc1