Reaction Details
TargetPhosphatidylinositol 4,5-bisphosphate 3-kinase catalytic subunit beta isoform
LigandBDBM139721
Substrate/Competitorn/a
Meas. Tech.HTRF Assay
IC50 6.2±n/a nM
Citation Scott, WJLiu, NMöwes, MHägebarth, AMönning, UBömer, U Aminoalcohol substituted 2,3-dihydroimidazo[1,2-c]quinazoline derivatives useful for treating hyper-proliferative disorders and diseases associated with angiogenesis US Patent US8895549 Publication Date 11/25/2014
 
Phosphatidylinositol 4,5-bisphosphate 3-kinase catalytic subunit beta isoform
Name:Phosphatidylinositol 4,5-bisphosphate 3-kinase catalytic subunit beta isoform
Type:Enzyme Subunit
Mol. Mass.:122769.00
Organism:Homo sapiens (Human)
Description:P42338
Residue:1070
BDBM139721
NameBDBM139721
Synonyms:US8895549, 3 | US9675616, 3 N-(8-{[(2S)-2-hydroxy-3-(morpholin-4-yl)propyl]oxy}-7-methoxy-2,3-dihydroimidazo[1,2-c]quinazolin-5-yl)pyridine-3-carboxamide
TypeSmall organic molecule
Emp. Form.C24H28N6O5
Mol. Mass.480.5163
SMILESCOc1c(OC[C@@H](O)CN2CCOCC2)ccc2C3=NCCN3C(NC(=O)c3cccnc3)=Nc12