Reaction Details
TargetPhosphatidylinositol 4,5-bisphosphate 3-kinase catalytic subunit beta isoform
LigandBDBM139727
Substrate/Competitorn/a
Meas. Tech.HTRF Assay
IC50 3.68±n/a nM
Citation Scott, WJLiu, NMöwes, MHägebarth, AMönning, UBömer, U Aminoalcohol substituted 2,3-dihydroimidazo[1,2-c]quinazoline derivatives useful for treating hyper-proliferative disorders and diseases associated with angiogenesis US Patent US8895549 Publication Date 11/25/2014
 
Phosphatidylinositol 4,5-bisphosphate 3-kinase catalytic subunit beta isoform
Name:Phosphatidylinositol 4,5-bisphosphate 3-kinase catalytic subunit beta isoform
Type:Enzyme Subunit
Mol. Mass.:122769.00
Organism:Homo sapiens (Human)
Description:P42338
Residue:1070
BDBM139727
NameBDBM139727
Synonyms:US8895549, 5
TypeSmall organic molecule
Emp. Form.C26H30N6O5
Mol. Mass.506.5536
SMILESCOc1c(OC[C@H](O)CN2CC3CCC(C2)O3)ccc2C3=NCCN3C(NC(=O)c3cccnc3)=Nc12