Reaction Details
TargetPhosphatidylinositol 4,5-bisphosphate 3-kinase catalytic subunit beta isoform
LigandBDBM139754
Substrate/Competitorn/a
Meas. Tech.HTRF Assay
IC50 2.78±n/a nM
Citation Scott, WJLiu, NMöwes, MHägebarth, AMönning, UBömer, U Aminoalcohol substituted 2,3-dihydroimidazo[1,2-c]quinazoline derivatives useful for treating hyper-proliferative disorders and diseases associated with angiogenesis US Patent US8895549 Publication Date 11/25/2014
 
Phosphatidylinositol 4,5-bisphosphate 3-kinase catalytic subunit beta isoform
Name:Phosphatidylinositol 4,5-bisphosphate 3-kinase catalytic subunit beta isoform
Type:Enzyme Subunit
Mol. Mass.:122769.00
Organism:Homo sapiens (Human)
Description:P42338
Residue:1070
BDBM139754
NameBDBM139754
Synonyms:US8895549, 19
TypeSmall organic molecule
Emp. Form.C26H32N6O4
Mol. Mass.492.5701
SMILESCOc1c(OC[C@H](O)CN2CCCCC2)ccc2C3=NCCN3C(NC(=O)c3cccnc3C)=Nc12