Reaction Details
TargetProtein O-GlcNAcase
LigandBDBM139928
Substrate/Competitorn/a
Meas. Tech.Inhibition Assay
pH7±n/a
Temperature298.15±n/a K
Ki 3.1±n/a nM
Commentsextracted
Citation Chang, JLiu, KMcEachern, EJMu, CSelnick, HGShi, FVocadlo, DJWang, YWei, ZZhou, YZhu, Y Selective glycosidase inhibitors and uses thereof US Patent US8901087 Publication Date 12/2/2014
 
Protein O-GlcNAcase
Name:Protein O-GlcNAcase
Type:Enzyme
Mol. Mass.:102874.67
Organism:Homo sapiens (Human)
Description:O60502
Residue:916
BDBM139928
NameBDBM139928
Synonyms:US8901087, 4
TypeSmall organic molecule
Emp. Form.C11H20N2O4S
Mol. Mass.276.352
SMILESCN(C)C1=N[C@H]2[C@H](O[C@@H]([C@@H](O)[C@@H]2O)C(C)(C)O)S1