Reaction Details
TargetTyrosine-protein kinase Fgr
LigandBDBM50400047
Substrate/Competitorn/a
Meas. Tech.Millipore Kinase Panel Assay
IC50 81±n/a nM
Citation Jia, ZJVenkataramani, CHuang, WMehrotra, MSong, YXu, QBauer, SMRose, JWKane, BPandey, A Inhibitors of syk and JAK protein kinases US Patent US8952027 Publication Date 2/10/2015
 
Tyrosine-protein kinase Fgr
Name:Tyrosine-protein kinase Fgr
Type:protein
Mol. Mass.:59469.88
Organism:Homo sapiens (Human)
Description:P09769
Residue:529
BDBM50400047
NameBDBM50400047
Synonyms:BIIB-057 US9579320, Example 87
TypeSmall organic molecule
Emp. Form.C19H23N9O
Mol. Mass.393.4456
SMILESN[C@H]1CCCC[C@H]1Nc1ncc(C(N)=O)c(Nc2cccc(c2)-n2nccn2)n1