Reaction Details
TargetTyrosine-protein kinase SYK
LigandBDBM50400047
Substrate/Competitorn/a
Meas. Tech.Inhibition Assay
IC50 6±n/a nM
Citation Jia, ZJVenkataramani, CHuang, WMehrotra, MSong, YXu, QBauer, SMRose, JWKane, BPandey, A Inhibitors of syk and JAK protein kinases US Patent US8952027 Publication Date 2/10/2015
 
Tyrosine-protein kinase SYK
Name:Tyrosine-protein kinase SYK
Type:Enzyme
Mol. Mass.:72079.99
Organism:Homo sapiens (Human)
Description:P43405
Residue:635
BDBM50400047
NameBDBM50400047
Synonyms:BIIB-057 US9579320, Example 87
TypeSmall organic molecule
Emp. Form.C19H23N9O
Mol. Mass.393.4456
SMILESN[C@H]1CCCC[C@H]1Nc1ncc(C(N)=O)c(Nc2cccc(c2)-n2nccn2)n1