Reaction Details
TargetRAC-alpha serine/threonine-protein kinase
LigandBDBM108426
Substrate/Competitorn/a
Meas. Tech.Thermal Shift Assay
Kd 0.4±n/a nM
Citation Ashwell, MABrassard, CFilikov, AHill, JKoerner, SLapierre, JLiu, YNamdev, NNicewonger, RPalma, RTandon, MVensel, DMatsuda, AIimura, SYoshida, KYamazaki, TKitamura, TIsoyama, T Substituted imidazopyridinyl-aminopyridine compounds US Patent US8962619 Publication Date 2/24/2015
 
RAC-alpha serine/threonine-protein kinase
Name:RAC-alpha serine/threonine-protein kinase
Type:Enzyme
Mol. Mass.:55681.25
Organism:Homo sapiens (Human)
Description:P31749
Residue:480
BDBM108426
NameBDBM108426
Synonyms:US8609688, 4
TypeSmall organic molecule
Emp. Form.C32H33N7O
Mol. Mass.531.6507
SMILESCC(C)(C)C(=O)Nc1cccc(c1)-c1ccc2nc(-c3cccnc3N)n(-c3ccc(cc3)C3(N)CCC3)c2n1