Reaction Details
TargetRAC-alpha serine/threonine-protein kinase
LigandBDBM108433
Substrate/Competitorn/a
Meas. Tech.Thermal Shift Assay
Kd 0.2±n/a nM
Citation Ashwell, MABrassard, CFilikov, AHill, JKoerner, SLapierre, JLiu, YNamdev, NNicewonger, RPalma, RTandon, MVensel, DMatsuda, AIimura, SYoshida, KYamazaki, TKitamura, TIsoyama, T Substituted imidazopyridinyl-aminopyridine compounds US Patent US8962619 Publication Date 2/24/2015
 
RAC-alpha serine/threonine-protein kinase
Name:RAC-alpha serine/threonine-protein kinase
Type:Enzyme
Mol. Mass.:55681.25
Organism:Homo sapiens (Human)
Description:P31749
Residue:480
BDBM108433
NameBDBM108433
Synonyms:US8609688, 11
TypeSmall organic molecule
Emp. Form.C37H40N8O2
Mol. Mass.628.7659
SMILESNc1ncccc1-c1nc2ccc(nc2n1-c1ccc(cc1)C1(N)CCC1)-c1cccc(c1)N1CCC(CC1)C(=O)N1CCOCC1