Reaction Details
TargetRAC-alpha serine/threonine-protein kinase
LigandBDBM108434
Substrate/Competitorn/a
Meas. Tech.Alpha Screen Assay
IC50 1.44±n/a nM
Citation Ashwell, MABrassard, CFilikov, AHill, JKoerner, SLapierre, JLiu, YNamdev, NNicewonger, RPalma, RTandon, MVensel, DMatsuda, AIimura, SYoshida, KYamazaki, TKitamura, TIsoyama, T Substituted imidazopyridinyl-aminopyridine compounds US Patent US8962619 Publication Date 2/24/2015
 
RAC-alpha serine/threonine-protein kinase
Name:RAC-alpha serine/threonine-protein kinase
Type:Enzyme
Mol. Mass.:55681.25
Organism:Homo sapiens (Human)
Description:P31749
Residue:480
BDBM108434
NameBDBM108434
Synonyms:US8609688, 12
TypeSmall organic molecule
Emp. Form.C34H36N8O
Mol. Mass.572.7026
SMILESCC(=O)NC1CCN(CC1)c1cccc(c1)-c1ccc2nc(-c3cccnc3N)n(-c3ccc(cc3)C3(N)CCC3)c2n1