Reaction Details
TargetHistone-lysine N-methyltransferase EZH2 [Y641F]
LigandBDBM172173
Substrate/Competitorn/a
Meas. Tech.Enzyme Assay
Temperature298.15±n/a K
IC50 2.23±n/a nM
Commentsextracted
Citation Kuntz, KWChesworth, RDuncan, KWKeilhack, HWarholic, NKlaus, CKnutson, SKWigle, TJSeki, MShirotori, SKawano, S Aryl- or heteroaryl-substituted benzene compounds US Patent US9090562 Publication Date 7/28/2015
 
Histone-lysine N-methyltransferase EZH2 [Y641F]
Name:Histone-lysine N-methyltransferase EZH2 [Y641F]
Type:n/a
Mol. Mass.:85351.84
Organism:Homo sapiens (Human)
Description:Q15910[Y641F]
Residue:746
BDBM172173
NameBDBM172173
Synonyms:US10155002, Compound 181 US9090562, 181
TypeSmall organic molecule
Emp. Form.C36H47N5O3
Mol. Mass.597.7901
SMILESCCN([C@H]1CC[C@@H](CC1)N(C)C)c1cc(cc(C(=O)NCc2c(C)cc(C)[nH]c2=O)c1C)-c1ccc(cc1)C(=O)N1CCC1