Reaction Details
TargetProtein arginine N-methyltransferase 1 [11-371]
LigandBDBM178101
Substrate/Competitorn/a
Meas. Tech.PRMT Biochemical Assays
Ki>10000±0.0 nM
IC50>20000±0.0 nM
Citation Eram, MSShen, YSzewczyk, MMWu, HSenisterra, GLi, FButler, KVKaniskan, HÿSpeed, BADela Seña, CDong, AZeng, HSchapira, MBrown, PJArrowsmith, CHBarsyte-Lovejoy, DLiu, JVedadi, MJin, J A Potent, Selective, and Cell-Active Inhibitor of Human Type I Protein Arginine Methyltransferases. ACS Chem Biol11:772-81 (2016) 
 
Protein arginine N-methyltransferase 1 [11-371]
Name:Protein arginine N-methyltransferase 1 [11-371]
Type:Protein
Mol. Mass.:41506.52
Organism:Homo sapiens (Human)
Description:Q99873[11-371]
Residue:361
BDBM178101
NameBDBM178101
Synonyms:N1-Methyl-N1-((5-(3-(trifluoromethyl)phenyl)-2H-1,2,3-triazol-4-yl)methyl)ethane-1,2-diamine (Compound 1)
TypeSmall organic molecule
Emp. Form.C13H16F3N5
Mol. Mass.299.2948
SMILESCN(CCN)Cc1n[nH]nc1-c1cccc(c1)C(F)(F)F