Reaction Details
TargetProtein arginine N-methyltransferase 8
LigandBDBM178103
Substrate/Competitorn/a
Meas. Tech.PRMT Biochemical Assays
Ki 1.3±0.03 nM
IC50 5±0.1 nM
Citation Eram, MSShen, YSzewczyk, MMWu, HSenisterra, GLi, FButler, KVKaniskan, HÿSpeed, BADela Seña, CDong, AZeng, HSchapira, MBrown, PJArrowsmith, CHBarsyte-Lovejoy, DLiu, JVedadi, MJin, J A Potent, Selective, and Cell-Active Inhibitor of Human Type I Protein Arginine Methyltransferases. ACS Chem Biol11:772-81 (2016) 
 
Protein arginine N-methyltransferase 8
Name:Protein arginine N-methyltransferase 8
Type:Protein
Mol. Mass.:45293.70
Organism:Homo sapiens (Human)
Description:n/a
Residue:394
BDBM178103
NameBDBM178103
Synonyms:MS023 (Compound 3) | N1-((4-(4-isopropoxyphenyl)-1H-pyrrol-3-yl)methyl)-N1-methylethane-1,2-diamine
TypeSmall organic molecule
Emp. Form.C17H25N3O
Mol. Mass.287.3999
SMILESCC(C)Oc1ccc(cc1)-c1c[nH]cc1CN(C)CCN