Reaction Details
TargetProstaglandin E synthase 2
LigandBDBM181889
Substrate/Competitorn/a
Meas. Tech.Biochemical Assay
pH6.8±n/a
IC50 91±n/a nM
Commentsextracted
Citation Bylund, JEk, MEGravenfors, YNordvall, GMinidis, AVallin, KSViklund, JHolenz, JVon Berg, SSohn, D Bis-(sulfonylamino) derivatives for use in therapy US Patent US9145380 Publication Date 9/29/2015
 
Prostaglandin E synthase 2
Name:Prostaglandin E synthase 2
Type:Enzyme
Mol. Mass.:41955.21
Organism:Homo sapiens (Human)
Description:Q9H7Z7
Residue:377
BDBM181889
NameBDBM181889
Synonyms:US9145380, 92
TypeSmall organic molecule
Emp. Form.C18H15FN2O4S2
Mol. Mass.406.451
SMILESNS(=O)(=O)c1ccc(F)cc1NS(=O)(=O)\C=C\c1ccc2ccccc2c1