Reaction Details
TargetProstaglandin E synthase 2
LigandBDBM181966
Substrate/Competitorn/a
Meas. Tech.Biochemical Assay
pH6.8±n/a
IC50 22±n/a nM
Commentsextracted
Citation Bylund, JEk, MEGravenfors, YNordvall, GMinidis, AVallin, KSViklund, JHolenz, JVon Berg, SSohn, D Bis-(sulfonylamino) derivatives for use in therapy US Patent US9145380 Publication Date 9/29/2015
 
Prostaglandin E synthase 2
Name:Prostaglandin E synthase 2
Type:Enzyme
Mol. Mass.:41955.21
Organism:Homo sapiens (Human)
Description:Q9H7Z7
Residue:377
BDBM181966
NameBDBM181966
Synonyms:US9145380, 169
TypeSmall organic molecule
Emp. Form.C18H16ClN3O5S2
Mol. Mass.453.92
SMILESCOc1ncc(cc1Cl)-c1cccc(c1)S(=O)(=O)Nc1ccccc1S(N)(=O)=O