Reaction Details
TargetSerine/threonine-protein kinase B-raf [V600E]
LigandBDBM185587
Substrate/Competitorn/a
Meas. Tech.Kinase Activity
IC50 26±n/a nM
Citation Bae, IHSon, JBHan, SMKwak, EJKim, HSSong, JYByun, EYJun, SAAhn, YGSuh, KH Thieno[3,2-D]pyrimidine derivatives having inhibitory activity for protein kinases US Patent US9156852 Publication Date 10/13/2015
 
Serine/threonine-protein kinase B-raf [V600E]
Name:Serine/threonine-protein kinase B-raf [V600E]
Type:n/a
Mol. Mass.:84474.98
Organism:Homo sapiens (Human)
Description:P15056 V600E
Residue:766
BDBM185587
NameBDBM185587
Synonyms:US9156852, 50 | USRE47451, Example 50
TypeSmall organic molecule
Emp. Form.C24H18F2N6O2S
Mol. Mass.492.501
SMILESCc1ccc2c(Nc3ccc(OC(F)F)cc3)nccc2c1NC(=O)c1csc2c(N)ncnc12