Reaction Details
TargetDiscoidin domain-containing receptor 2
LigandBDBM185589
Substrate/Competitorn/a
Meas. Tech.Kinase Activity
IC50 10±n/a nM
Citation Bae, IHSon, JBHan, SMKwak, EJKim, HSSong, JYByun, EYJun, SAAhn, YGSuh, KH Thieno[3,2-D]pyrimidine derivatives having inhibitory activity for protein kinases US Patent US9156852 Publication Date 10/13/2015
 
Discoidin domain-containing receptor 2
Name:Discoidin domain-containing receptor 2
Type:Protein
Mol. Mass.:96717.07
Organism:Homo sapiens (Human)
Description:Q16832
Residue:855
BDBM185589
NameBDBM185589
Synonyms:US9156852, 83 | USRE47451, Example 83
TypeSmall organic molecule
Emp. Form.C25H20N6O2S
Mol. Mass.468.53
SMILESCC(=O)c1ccc(Nc2nccc3c(NC(=O)c4csc5c(N)ncnc45)c(C)ccc23)cc1