Reaction Details
TargetSerine/threonine-protein kinase mTOR
LigandBDBM288310
Substrate/Competitorn/a
Meas. Tech.KINOMEscan Enzyme Binding Assays
Kd 7943±n/a nM
Citation Mevellec, LAMeerpoel, LCoupa, SPoncelet, VSPilatte, INPasquier, ETBerthelot, DJQuerolle, OAMeyer, CAngibaud, PRDemestre, CGMercey, GJ Imidazopyridazine derivatives as PI3KB inhibitors US Patent US10087187 Publication Date 10/2/2018
 
Serine/threonine-protein kinase mTOR
Name:Serine/threonine-protein kinase mTOR
Type:Rapamycin target protein
Mol. Mass.:288917.12
Organism:Homo sapiens (Human)
Description:P42345
Residue:2549
BDBM288310
NameBDBM288310
Synonyms:US10087187, Compound 3
TypeSmall organic molecule
Emp. Form.C22H27F3N6O2
Mol. Mass.464.484
SMILESCc1c(Cc2c(CNCCO)nc3c(N)cc(nn23)N2CCOCC2)cccc1C(F)(F)F