Reaction Details
TargetPhosphatidylinositol 4-phosphate 3-kinase C2 domain-containing subunit beta
LigandBDBM288320
Substrate/Competitorn/a
Meas. Tech.KINOMEscan Enzyme Binding Assays
Kd 0.500±n/a nM
Citation Mevellec, LAMeerpoel, LCoupa, SPoncelet, VSPilatte, INPasquier, ETBerthelot, DJQuerolle, OAMeyer, CAngibaud, PRDemestre, CGMercey, GJ Imidazopyridazine derivatives as PI3KB inhibitors US Patent US10087187 Publication Date 10/2/2018
 
Phosphatidylinositol 4-phosphate 3-kinase C2 domain-containing subunit beta
Name:Phosphatidylinositol 4-phosphate 3-kinase C2 domain-containing subunit beta
Type:Enzyme
Mol. Mass.:184784.86
Organism:Homo sapiens (Human)
Description:O00750
Residue:1634
BDBM288320
NameBDBM288320
Synonyms:US10087187, Compound 13
TypeSmall organic molecule
Emp. Form.C20H21ClN4O3
Mol. Mass.400.859
SMILESCc1nc2c(cc(nn2c1Cc1cccc(Cl)c1C)N1CCOCC1)C(O)=O