Reaction Details
TargetPhosphatidylinositol 4,5-bisphosphate 3-kinase catalytic subunit gamma isoform
LigandBDBM288388
Substrate/Competitorn/a
Meas. Tech.KINOMEscan Enzyme Binding Assays
Kd>30200±n/a nM
Citation Mevellec, LAMeerpoel, LCoupa, SPoncelet, VSPilatte, INPasquier, ETBerthelot, DJQuerolle, OAMeyer, CAngibaud, PRDemestre, CGMercey, GJ Imidazopyridazine derivatives as PI3KB inhibitors US Patent US10087187 Publication Date 10/2/2018
 
Phosphatidylinositol 4,5-bisphosphate 3-kinase catalytic subunit gamma isoform
Name:Phosphatidylinositol 4,5-bisphosphate 3-kinase catalytic subunit gamma isoform
Type:Enzyme Subunit
Mol. Mass.:126470.30
Organism:Homo sapiens (Human)
Description:P48736
Residue:1102
BDBM288388
NameBDBM288388
Synonyms:US10087187, Compound 83
TypeSmall organic molecule
Emp. Form.C28H34F3N7O5
Mol. Mass.605.6087
SMILESCc1c(Nc2c(COC(=O)C3(CC3)NC(=O)OC(C)(C)C)nc3c(N)cc(nn23)N2CCOCC2)cccc1C(F)(F)F