Reaction Details
TargetPhosphatidylinositol 4-phosphate 3-kinase C2 domain-containing subunit alpha
LigandBDBM288390
Substrate/Competitorn/a
Meas. Tech.KINOMEscan Enzyme Binding Assays
Kd>23016±n/a nM
Citation Mevellec, LAMeerpoel, LCoupa, SPoncelet, VSPilatte, INPasquier, ETBerthelot, DJQuerolle, OAMeyer, CAngibaud, PRDemestre, CGMercey, GJ Imidazopyridazine derivatives as PI3KB inhibitors US Patent US10087187 Publication Date 10/2/2018
 
Phosphatidylinositol 4-phosphate 3-kinase C2 domain-containing subunit alpha
Name:Phosphatidylinositol 4-phosphate 3-kinase C2 domain-containing subunit alpha
Type:Protein
Mol. Mass.:190704.50
Organism:Homo sapiens (Human)
Description:O00443
Residue:1686
BDBM288390
NameBDBM288390
Synonyms:US10087187, Compound 85
TypeSmall organic molecule
Emp. Form.C19H22F3N7O
Mol. Mass.421.4195
SMILESCc1c(Nc2c(CN)nc3c(N)cc(nn23)N2CCOCC2)cccc1C(F)(F)F