Reaction Details
TargetHistamine H4 receptor
LigandBDBM189344
Substrate/Competitorn/a
Meas. Tech.In vitro [3H]histamine Binding Assay
pH7.4±n/a
Temperature277.15±n/a K
Ki 3.88e+3±n/a nM
Commentsextracted
Citation Latacz, GKechagioglou, PPapi, RLazewska, DWiecek, MKaminska, KWencel, PKarcz, TSchwed, JSStark, HKyriakidis, DAKiec-Kononowicz, K The Synthesis of 1,3,5-triazine Derivatives and JNJ7777120 Analogues with Histamine H4 Receptor Affinity and Their Interaction with PTEN Promoter. Chem Biol Drug Des88:254-63 (2016) 
 
Histamine H4 receptor
Name:Histamine H4 receptor
Type:G Protein-Coupled Receptor (GPCR)
Mol. Mass.:44517.02
Organism:Homo sapiens (Human)
Description:Binding assays were using CHO cells stably expressing hH4R receptors.
Residue:390
BDBM189344
NameBDBM189344
Synonyms:(3-Chlorophenyl)(4-methylpiperazin-1-yl)methanone (2)
TypeSmall organic molecule
Emp. Form.C12H15ClN2O
Mol. Mass.238.713
SMILESCN1CCN(CC1)C(=O)c1cccc(Cl)c1