Reaction Details
TargetLysine-specific demethylase 5D [1-775]
LigandBDBM191598
Substrate/Competitorn/a
Meas. Tech.Demethylase AlphaScreen Assay
pH7.5±n/a
IC50 15±n/a nM
Commentsextracted
Citation Johansson, CVelupillai, STumber, ASzykowska, AHookway, ESNowak, RPStrain-Damerell, CGileadi, CPhilpott, MBurgess-Brown, NWu, NKopec, JNuzzi, ASteuber, HEgner, UBadock, VMunro, SLaThangue, NBWestaway, SBrown, JAthanasou, NPrinjha, RBrennan, PEOppermann, U Structural analysis of human KDM5B guides histone demethylase inhibitor development. Nat Chem Biol12:539-45 (2016) 
 
Lysine-specific demethylase 5D [1-775]
Name:Lysine-specific demethylase 5D [1-775]
Type:Protein
Mol. Mass.:89076.46
Organism:Homo sapiens (Human)
Description:Human KDM5D (1-775 aa)
Residue:775
BDBM191598
NameBDBM191598
Synonyms:2-(((2-((2-(dimethylamino)ethyl)(ethyl)amino)-2-oxoethyl)amino)methyl)isonicotinic acid (KDM5-C49) KDOAM-20
TypeSmall organic molecule
Emp. Form.C15H24N4O3
Mol. Mass.308.3761
SMILESCCN(CCN(C)C)C(=O)CNCc1cc(ccn1)C(O)=O